i’ : undeclared identifier 1>c:usersarrondesktoplab9lab9lab9.cpp(43) : error C2146: syntax error : missing ‘;’ before identifier ‘AnnualRainfall’ 1>c:usersarrondesktoplab9lab9lab9.cpp(43).

Your problem does not seem to be in the structure declaration, but rather where you try to use it. The code you showed does not hold any cfg identifier. Find this identifier in your code, you most likely forgot to terminate one of your statements with a semicolon.

1>bcdatabase.cpp 1>c:program filesmicrosoft sdkswindowsv6.0aincludewtypes.h(83) : error C2146: syntax error : missing ‘;’ before identifier ‘data’ 1>c:program filesmicrosoft sdkswindowsv6.0a.

Aug 02, 2017  · You need to include windows.h rather than winnt.h.When you include windows.h it will, in turn, include winnt.h.You need to do it this way for the necessary macros to be in place that are needed to compile winnt.h. In this case, POINTER_64 is defined in.

Jul 31, 2012  · This may be a matter of having the wrong order of #include statements. Try putting #include <Windows.h> immediately after #include <stdafx.h> and see if that makes a difference.

Mar 08, 2012  · What is the pre-compiled header file being used? By default it is stdafx.h. Use have to #include this file in debugext.cpp and utility.cpp. Also make.

Magick++ is an object-oriented C++ interface to ImageMagick. Use this forum to discuss, make suggestions about, or report bugs concerning Magick++.

141 IntelliSense: identifier "PVOID64" is undefined c:program files (x86)microsoft visual studio 10.0vcincludewinnt.h 5940 5

Dec 21, 2017  · Hi, I’m trying to install the package according to the instructions and get the following: C:temppyflow>python setup.py build_ext -i Compiling pyflow.pyx because it changed. [1/1] Cythonizing pyflow.pyx running build_ext building ‘pyfl.

syntax error : identifier ‘Adventure’ adventure.cpp(211): error C2660: ‘Game::addtoHallofFame’ : function does not take 1 arguments adventure.h(20): error C2146: syntax error : missing ‘;’ before.

Jul 14, 2011  · It’s bad style, yes, that the headers depend on each other, but they each have include guards. If main.h is included, then main_h is defined, capplication.h is included, capplication_h is defined, main.h is included, but main_h is defined so the PP goes back to capplication.h, then to main.h.It appears to me that the definition of class CApplication would be above extern CApplication g_App; in.

Meaning Of Diachronic Linguistics In the present study, connectors are defined as linguistic items which signal a two-place relation. here called ‘connects’ (for this term see Pasch et al. 2003). The meaning of a connector is. diachronic definition: of or concerned with

Dec 30, 2010  · I may have a solution that doesn’t involve modifying the base files. In "Tools -> Options -> Projects and Solutions -> VC++ Directories -> Include Files" make sure the default include folders are first, and put any extra include folders you want here.

Didn’t solve the problem though, now I’m getting those error messages at part two AND part three. c:program filesmicrosoft visual studiomyprojectslatestvoorbeeldenboekvervolgvkv.h(1. error.

error C2146: syntax error : missing ‘;’ before identifier ‘$’ c:userscaroledocumentsvisual studio 2008projectscompsci-assign11compsci-assign11compsci-assign11.cpp(40) : error C2065: ‘$’ :.

Please help me run this program, i forgot the output of this. c:documents and settingsuserdesktopcpptryuntitled1.cpp(24) : error C2146: syntax error : missing ‘;’ before identifier ‘sum’.

Your problem does not seem to be in the structure declaration, but rather where you try to use it. The code you showed does not hold any cfg identifier. Find this identifier in your code, you most likely forgot to terminate one of your statements with a semicolon.

Teams. Q&A for Work. Setup a private space for you and your coworkers to ask questions and share information. Learn more about Teams

Feb 25, 2013  · I mean in my code where to put it. Anyway thanks for the help so far. I tried to find how to put it inside the header guard. But i coldn’t find it yet.

Aug 02, 2017  · You need to include windows.h rather than winnt.h.When you include windows.h it will, in turn, include winnt.h.You need to do it this way for the necessary macros to be in place that are needed to compile winnt.h. In this case, POINTER_64 is defined in.

Justice Social Link Persona 4 May 22, 2014. During my first game on the PSP version, I persisted in wanting Junpei as boyfriend for the heroin. But I should know that I would fail. Not only. Persona 4. Justice, Magician, Death, etc). You

You can get help here, but you need to tell us what your understanding of the issue is before. 1>c:userszvjezdandocumentsvisual studio 2010projectsweek5_mathweek5_mathprogram.cpp(117):.

error C2146: syntax error : missing ‘;’ before identifier ‘counter’ c:documents and settingstommy documentsvisual studio 2008projectsengineenginetimer.h(7) : error C4430: missing type.

After changing everything required (basic syntax editing and changing Lists. visual studio 10.0vcincludexutility 373 1 hw9_2_cpp Error 5 error C2146: syntax error : missing ‘;’ before identifier.

Please provide me with some debuggings. This is urgent. 1>c:usersfofadocumentsvisual studio 2005projectscs102 projmainmenu.cpp(14) : error C2146: syntax error : missing ‘)’ before identifier.

I’m not sure what it is that I’m missing. Any help would be greatly appreciated. datamax incfinal project datamax inc.cpp(50): error C2146: syntax error : missing ‘;’ before identifier ”.

Philosophy Of Science An Historical Anthology Timothy McGrew, Marc Alspector-Kelly, and Fritz Allhoff, The Philosophy of Science: An Historical Anthology (Oxford: Wiley-Blackwell, 2009). Paperback, xix+660 pp. Review by Liz Stillwagon Swan in Philosophy of Science 77.1 (2010), pp. 141-143.Review by Liz Stillwagon Swan in

Feb 25, 2010  · This site uses cookies for analytics, personalized content and ads. By continuing to browse this site, you agree to this use. Learn more

Feb 25, 2010  · This site uses cookies for analytics, personalized content and ads. By continuing to browse this site, you agree to this use. Learn more

. c:programmicrosoft visual studio 10.0vcincludecodeanalysissourceannotations.h(244): error C2146: syntax error : missing ‘;’ before identifier ‘SA_YesNoMaybe’ c:programmicrosoft visual.

Note: C++ does not support default-int 1>c:program filesmicrosoft visual studio 10.0vcincludeiostream.h(35): error C2146: syntax error : missing ‘;’ before identifier ‘istringstream’ 1>c:program.

However, I am getting syntax errors in mmap.tlh file while reading it like the following error C2146: syntax error : missing ‘;’ before identifier ‘BackPicture’ error C2501: ‘PicturePtr’ : missing.

Note: C++ does not support default-int 1>c:visual studio 2008projectstestapp1testapp1runner.h(8) : error C2146: syntax error : missing ‘;’ before identifier ‘m_name’ 1>c:visual studio.

c:program filesmicrosoft visual studio 9.0vcincludeiosfwd(574) : error C2146: syntax error : missing ‘;’ before identifier ‘_Char_traits_cat’ 1>c:program filesmicrosoft visual studio.

Scholarly Articles About The Health Risks Related To Companys Polluting Our Water Prescribing antibiotics immediately for elderly patients with urinary tract infections is linked with a reduced risk. our study suggests early use of antibiotics in elderly patients with UTIs is. Lecture Notes On Microprocessor Livescribe, the maker of a

Jun 13, 2014  · I’m creating a MFC apps, (Genetic Algorithm Timetable). I’m running it in VisualStudio2012. And I ran into this error. c:userszahrinadocumentsvisual studio 2012.

This topic describes some common build errors and how to resolve them.

_RecordsetPtr’ : undeclared identifier 1>c:dvlptest2test2test2.cpp(27) : error C2146: syntax error : missing ‘;’ before identifier ‘pRstAuthors’ 1>c:dvlptest2test2test2.cpp(27) : error C2065:.

What Have You Done Academically To Be Selected As A Gks Scholar? you. You have encouraged me as well as supported me. This document is a testimony for my three children, Julius Jr. (UCF-2011), Valua (FSU-2011), and Carmilla (TSHS-2011) that you can do all things through Christ. To Tonya, my

The program should be able to perform the following on an object of the class: 1>.Lab1 test.cpp(46) : error C2146: syntax error : missing ‘;’ before identifier ‘First’ 1>.Lab1 test.cpp(46) : error.

Jan 13, 2014  · Is that causing this particular compiler error? Your solution seems to address circular dependencies includes, which should already be handled by #pragma once. @bilbsyy I don’t see a missing semicolon in your code you’ve posted. Inside all the files you’ve included, double-check that your class declarations all end in a semicolon.

Research Papers On Network Security Catherine West, a Research Assistant Professor of Anthropology and Archaeology and a Faculty Research Fellow at the Frederick S. Pardee Center for the Study of the Longer-Range Future, recently. Hosted by the Government of the Netherlands, it is

May 11, 2013  · i have a header file which contained all of the class’ functions including code so the class didn’t have a cpp file. everything worked. I added the cpp file and moved the function code over to that.